H2O Build fails on Windows and Clean Ubuntu Linux

Description

Following build command from docs on windows, after fresh install from git

gradlew build -x test

:h2o-r:cpH2OAppJar
:h2o-r:setDevPackageFiles
:h2o-r:setPackageFiles
:h2o-r:buildPackageDocumentation FAILED

FAILURE: Build failed with an exception.

  • What went wrong:
    Execution failed for task ':h2o-r:buildPackageDocumentation'.
    > Process 'command 'cmd'' finished with non-zero exit value 1

  • Try:
    Run with --stacktrace option to get the stack trace. Run with --info or --debug option to get more log output.

BUILD FAILED

Total time: 30.061 secs

Task timings:
10.849 secs :h2o-assemblies:main:shadowJar
7.523 secs :h2o-bindings:runGenerateRESTAPIBindingsSrc
3.726 secs :h2o-py:buildDist
1.801 secs :h2o-web:installNpmPackages
1.514 secs :h2o-bindings:compileJava
0.633 secs :h2o-web:installBowerPackages
0.502 secs :h2o-assemblies:main:copyJar
2.204 secs All others

C:\dev\h2o>

Assignee

New H2O Bugs

Fix versions

None

Reporter

Rhys Newman

Support ticket URL

None

Labels

None

Affected Spark version

None

Customer Request Type

Support Incident

Task progress

None

CustomerVisible

No

Support Assessment

Platform Issue

Components

Priority

Critical
Configure