Uploaded image for project: 'SW'
  1. SW-740

Increase timeout for conversion in pyunit test for external cluster

    Details

    • Type: Bug
    • Status: Resolved
    • Priority: Major
    • Resolution: Fixed
    • Affects Version/s: None
    • Fix Version/s: 2.0.26, 2.1.25, 2.2.11, 2.3.0
    • Component/s: None
    • Labels:
      None
    • CustomerVisible:
      No

      Description

      ======================================================================

      FAIL: test_sparse_data_conversion (_main_.FrameTransformationsTest)

      ----------------------------------------------------------------------

      Traceback (most recent call last):

      File "tests/tests_unit_conversions.py", line 198, in test_sparse_data_conversion

      assert total < 10 # The conversion should not take longer then 10 seconds

      AssertionError

      ----------------------------------------------------------------------

      Ran 18 tests in 100.899s

      FAILED (failures=1)

      Traceback (most recent call last):

      File "tests/tests_unit_conversions.py", line 250, in <module>

      generic_test_utils.run_tests(FrameTransformationsTest, file_name="py_unit_tests_conversions_report")

      File "/home4/jenkins/slave_dir_from_mr-0xb1/workspace/r_pipeline_external_rel-2.0-2GDN3ZHNYY6NRHCNFS6U3AKPFL5YK4IN5HTFNQIDPM7D4355JVLA/py/tests/generic_test_utils.py", line 74, in run_tests

      raise Exception(result)

      Exception: <unittest.runner.TextTestResult run=18 errors=0 failures=1>

      /home4/jenkins/slave_dir_from_mr-0xb1/workspace/r_pipeline_external_rel-2.0-2GDN3ZHNYY6NRHCNFS6U3AKPFL5YK4IN5HTFNQIDPM7D4355JVLA/py/build/dist/h2o_pysparkling_2.0-2.0.24-SNAPSHOT.zip/pysparkling/context.py:161: UserWarning: Stopping H2OContext from PySparkling is not fully supported. Please restart your PySpark session and create a new H2OContext.

      warnings.warn("Stopping H2OContext from PySparkling is not fully supported. Please restart your PySpark session and create a new H2OContext.")

      H2O session _sid_b444 closed.

      :sparkling-water-py:testPythonConversions FAILED

      FAILURE: Build failed with an exception.

        Attachments

          Activity

            People

            • Assignee:
              Kuba Jakub Hava
              Reporter:
              Kuba Jakub Hava
            • Votes:
              0 Vote for this issue
              Watchers:
              1 Start watching this issue

              Dates

              • Created:
                Updated:
                Resolved: